{"text_format":"3","workbook":"xlsx","n_sheets":7,"sheets":["Instructions","Data","Codebook","RelevantImages","ChangeLog","Dropdowns","For developers"],"not_rendered":{"macros":1,"defined_names":108},"read":"whole","date_system":"1900"}

{"sheet":"Instructions","index":0,"n_rows":31,"n_cols":3,"rows_kept":31}
[]
[null,"INSTRUCTIONS"]
[]
[null,"This is the Excel spreadsheet version of the EMMIE coding tool, there are several components to this tool, and these have been separated using thick borders.  You enter the data on the 'Data' tab."]
[]
[null,"Please note that for every dimension of EMMIE, there are 'evidence' (-E) codes and 'quality' (-Q) codes.  The former refers to evidence (data) extraction and comes first.  Quality codes refer to evidence appraisal and follow for each dimension."]
{"$rows_left_out":26}
{"sheet":"Data","index":1,"n_rows":13,"n_cols":139,"rows_kept":13,"merged":[[0,0,0,1],[0,77,0,91],[0,96,0,100],[0,123,0,137]]}
["INTERNAL REFERENCE",{"$nulls":19},"EFFECT EVIDENCE CODES",{"$nulls":16},"EFFECT QUALITY CODES",{"$nulls":15},"MECHANISM EVIDENCE CODES",{"$nulls":3},"MECHANISM QUALITY CODES",{"$nulls":14},"MODERATOR (CONTEXT) EVIDENCE CODES",{"$nulls":4},"MODERATOR (CONTEXT) QUALITY CODES",{"$nulls":15},"IMPLEMENTATION EVIDENCE CODES",null,null,"IMPLEMENTATION QUALITY CODES",{"$nulls":15},"ECONOMICS EVIDENCE CODES",{"$nulls":10},"ECONOMICS QUALITY CODES",{"$nulls":14},"INTERNAL CODE"]
[1,2,3,4,5,6,7,8,9,10,11,12,13,14,15,16,17,18,19,null,20,21,22,23,24,25,26,27,28,29,30,31,32,33,34,35,36,37,38,39,40,41,42,43,44,45,46,47,48,49,50,51,null,52,53,54,55,56,57,58,59,60,61,{"$nulls":7},62,null,63,64,65,66,67,68,69,70,71,72,73,74,{"$nulls":7},75,null,76,77,78,79,80,81,82,83,{"$nulls":9},84,85,86,85,86,87,88,89,90,91,92,93,94,95,96,97,98,99,100,101,{"$nulls":7},102,103]
["Codername","Reference","Intervention description","OffTreatment","Offenderfocus","Victimfocus","Placefocus","TargetedOffpop","TargetedNonpop","TargetedPopSub","CrimeOutcomes","NonCrimeOutcomes","OutcomeDataType","OutcomeProperty","OutcomeViolent","OutcomeCriminality","OutcomeDetection","OutcomeAntisocial","NoStudies","Evidence-E","EFFECT-E","EFFECTTYPE-E","EFFLOWER-E","EFFUPPER-E","EFFSE-E","EFFNSTUDIES-E","EFFNCONTROL-E","EFFCONTGRP-E","EFFNACTION-E","EFFMOD-E","EFFSTAT-E","Otherbias-E","Effectinwords","EffectInterpretation1","EffectInterpretation2","Meta-analysis","EffectSizeCalculations","EFFSearchstratALL-Q","Effectsizeapp-Q","EFFheterogeneity-Q","EFFRandomodel-Q","EFFdependency-Q","EFFweighting-Q","EFFStatconvalALL-Q","EFFpubbias-Q","EFFinterater-Q","EFFoutliers-Q","EFFriskbiasALL-Q","EFFConstvalALL-Q","EFFStudesignALL-Q","EFFunantioutALL-Q","EffectQSCORE","Mechamism-E","MECHLITSOURC-E","MECHMAP-E","MECHMOD-E","MECHSTAT-E","MECHMENT-Q","MECHLIT-Q","MECHPRAC-Q","MECHFORM-Q","MECHCOL-Q","MECHCON-Q","MECHMENT= Yes","MECHLIT &/ MECHPRAC=Yes","MECHFORM =Yes-BASIC","MECHFORM =Yes-THOROUGH","MECHCOL = Yes - BASIC","MECHCOL = Yes - THOROUGH","MECHCON =Yes","MechanismQSCORE","Moderator-E","MODLITSOURC-E","MODMOD-E","MOMMODPH-E","MODSTAT-E","MODEFF-E","MODMENT-Q","MODLIT-Q","MODPRAC-Q","MODFORM-Q","MODCOL-Q","MODSUB-Q","MODSUB-Q(APRIOR)","MODMENT=Yes","MODLIT=Yes-Basic","MODLIT=Yes-THOROUGH","MODPRAC=Yes","MODFORM=Yes","MODCOL or MODSUB=Yes","MODSUB (APRIOR)=Yes","ModeratorQSCORE","Implementation-E","IMPLITSOURC-E","IMPNECIMP-E","IMPNECREP-E","IMPMENT-Q","IMPDES-Q","IMPOBST-Q","IMPCRSUCC-Q","IMPREP-Q","IMPMENT=Yes","IMPDES= Yes-Basic","IMPDES= Yes-Thorough","IMPOBST= Yes-Basic","IMPOBST= Yes-Thorough","IMPCRSUCC= Yes-Basic","IMPCRSUCC= Yes-Thorough","IMPREP= Yes-Basic","IMPREP= Yes-Thorough","ImplementationQScore","Economics-E","ECOINPUTS-E","ECOOUTPUTS-E","ECOINTENS-E","ECOdirectCOSTIMP-E","ECOCOSTIMPSUB-E","ECOindirectCOST-E","ECOCOSTEFF-E","ECOCOSTEFSUB-E","ECONCOSTSOURCE-E","ECOCOSTBEN-E","ECOCOSTBENSUB-E","ECONdirectSETUP-Q","ECONindirectSETUP-Q","ECONINTERVPEROUT-Q","ECODIRCOSTBENEFIT-Q","ECONCOSTPEROUTCOME-Q","ECOINDIRCOSTBENE-Q","ECOINDIRCBSTAKE-Q","88=Yes","89=Yes","90=Yes","91=Yes","92=Yes","93=Yes","94=Yes","EconomicsQSCORE","CODERSNOTE"]
[{"$f":"HYPERLINK(\"#'Codebook'!\"&CELL(\"address\"),\"Codebook\")","v":"Codebook"},"Codebook","Codebook","Codebook","Codebook","Codebook","Codebook","Codebook","Codebook","Codebook","Codebook","Codebook","Codebook","Codebook","Codebook","Codebook","Codebook","Codebook","Codebook",null,"Codebook","Codebook","Codebook","Codebook","Codebook","Codebook","Codebook","Codebook","Codebook","Codebook","Codebook","Codebook","Codebook","Codebook","Codebook","Codebook","Codebook","Codebook","Codebook","Codebook","Codebook","Codebook","Codebook","Codebook","Codebook","Codebook","Codebook","Codebook","Codebook","Codebook","Codebook","Codebook",null,"Codebook","Codebook","Codebook","Codebook","Codebook","Codebook","Codebook","Codebook","Codebook","Codebook",{"$nulls":7},"Codebook",null,"Codebook","Codebook","Codebook","Codebook","Codebook","Codebook","Codebook","Codebook","Codebook","Codebook","Codebook","Codebook",{"$nulls":7},"Codebook",null,"Codebook","Codebook","Codebook","Codebook","Codebook","Codebook","Codebook","Codebook",{"$nulls":9},"Codebook",null,"Codebook","Codebook","Codebook","Codebook","Codebook","Codebook","Codebook","Codebook","Codebook","Codebook","Codebook","Codebook","Codebook","Codebook","Codebook","Codebook","Codebook","Codebook",{"$nulls":7},"Codebook"]
[{"$nulls":19},{"$f":"IF(COUNTIF(U5:AE5,\"\")=0, \"Yes\", \"No\")","v":"No"},{"$nulls":23},{"$f":"IF(COUNTIF(AL5:AQ5,\"\")=COLUMNS(AL5:AQ5),\"\",IF(COUNTIF(AM5:AQ5,\"Yes\")<4,\"No\",\"Yes\"))","v":""},{"$nulls":3},{"$f":"IF(COUNTIF(AS5:AU5,\"\")=COLUMNS(AS5:AU5),\"\",IF(COUNTIF(AS5:AU5,\"Yes\")<2,\"No\",\"Yes\"))","v":""},{"$nulls":3},{"$f":"IF(COUNTIF(AV5:AY5,\"\")=COLUMNS(AV5:AY5),\"\",IF((COUNTIF(AV5:AY5,\"Yes\")+COUNTIF(AR5,\"Yes\")+COUNTIF(AL5,\"Yes\"))>=5,Dropdowns!$R$6,IF((COUNTIF(AV5:AY5,\"Yes\")+COUNTIF(AR5,\"Yes\")+COUNTIF(AL5,\"Yes\"))=4,Dropdowns!$R$5,IF((COUNTIF(AV5:AY5,\"Yes\")+COUNTIF(AR5,\"Yes\")+COUNTIF(AL5,\"Yes\"))=3,Dropdowns!$R$5,IF((COUNTIF(AV5:AY5,\"Yes\")+COUNTIF(AR5,\"Yes\")+COUNTIF(AL5,\"Yes\"))=2,Dropdowns!$R$4,IF((COUNTIF(AV5:AY5,\"Yes\")+COUNTIF(AR5,\"Yes\")+COUNTIF(AL5,\"Yes\"))=1,Dropdowns!$R$3,IF((COUNTIF(AV5:AY5,\"Yes\")+COUNTIF(AR5,\"Yes\")+COUNTIF(AL5,\"Yes\"))=0,Dropdowns!$R$2, \"NULL\")))))))","v":""},{"$f":"IF(COUNTIF(BB5:BE5, \"\")=0,\"Yes\",\"No\")","v":"No"},{"$nulls":10},{"$f":"COUNTIF(BF5, \"Yes\")","v":0},{"$f":"COUNTIF(BG5:BH5, \"Yes*\")","v":0},{"$f":"COUNTIF(BI5, \"Yes - BASIC\")","v":0},{"$f":"COUNTIF(BI5, \"Yes - THOROUGH\")","v":0},{"$f":"COUNTIF(BJ5, \"Yes - BASIC\")","v":0},{"$f":"COUNTIF(BJ5, \"Yes - THOROUGH\")","v":0},{"$f":"COUNTIF(BK5, \"Yes\")","v":0},{"$f":"IF(COUNTIF(BF5:BK5,\"\")=COLUMNS(BF5:BK5),\"\",IF(AND(BL5+BM5+BO5+BR5=0),Dropdowns!$U$2,IF(AND(BL5=1,BM5>=0,BO5+BP5+BQ5+BR5=0, BN5>=0),Dropdowns!$U$3,IF(AND(BL5=1,BM5>=0,BN5+BP5=2,BO5+BQ5=0, BR5>=0),Dropdowns!$U$4,IF(AND(BL5=1,BM5>=0,BN5=0,BO5=1,BP5>=0,BQ5=0,BR5>=0),Dropdowns!$U$5,IF(AND(BL5=1,BM5>=1,BN5=0,BO5=1,BP5=0,BQ5=1,BR5>=0),Dropdowns!$U$6,\"NULL\"))))))","v":""},{"$f":"IF(COUNTIF(BU5:BY5,\"\")=0,\"Yes\",\"No\")","v":"No"},{"$nulls":12},{"$f":"COUNTIF(BZ5, \"Yes*\")","v":0},{"$f":"COUNTIF(CA5, \"Yes - BASIC\")","v":0},{"$f":"COUNTIF(CA5, \"Yes - THOROUGH\")","v":0},{"$f":"COUNTIF(CB5, \"Yes*\")","v":0},{"$f":"COUNTIF(CC5, \"Yes*\")","v":0},{"$f":"COUNTIF(CD5:CE5, \"Yes\")","v":0},{"$f":"COUNTIF(CF5, \"Yes\")","v":0},{"$f":"IF(COUNTIF(BZ5:CF5,\"\")=COLUMNS(BZ5:CF5),\"\",IF(AND(CG5=0,CH5=0,CJ5=0,CK5=0,CL5=0,CM5=0),Dropdowns!$V$2,IF(AND(CG5=1,(CH5+CI5=0),CJ5=0,CK5=0,CL5=0,CM5=0),Dropdowns!$V$3,IF(AND(CG5=1,(CH5>=0),CI5=0,(CJ5>=0),(CK5>=0),CL5=2,CM5=0),Dropdowns!$V$4,IF(AND(CG5=1,(OR(CH5+CI5+CJ5>=2,CI5=1)),CK5=1,CL5>=0,CM5=0),Dropdowns!$V$5,IF(AND(CG5=1,(OR(CH5+CI5+CJ5>=2,CI5=1)),CK5=1,CL5=2,CM5=1),Dropdowns!$V$6,\"NULL\"))))))","v":""},{"$f":"IF(COUNTIF(CP5:CR5, \"\")=0,\"Yes\",\"No\")","v":"No"},{"$nulls":8},{"$f":"COUNTIF(CS5, \"Yes\")","v":0},{"$f":"COUNTIF(CT5,\"Yes - BASIC\")","v":0},{"$f":"COUNTIF(CT5, \"Yes - THOROUGH\")","v":0},{"$f":"COUNTIF(CU5, \"Yes - BASIC\")","v":0},{"$f":"COUNTIF(CU5, \"Yes - THOROUGH\")","v":0},{"$f":"COUNTIF(CV5, \"Yes - BASIC\")","v":0},{"$f":"COUNTIF(CV5, \"Yes - THOROUGH\")","v":0},{"$f":"COUNTIF(CW5, \"Yes - BASIC\")","v":0},{"$f":"COUNTIF(CW5, \"Yes - THOROUGH\")","v":0},{"$f":"IF(COUNTIF(CT5:CW5,\"\")=COLUMNS(CT5:CW5),\"\",IF(AND(CX5+CY5+CZ5+DA5+DB5+DC5+DD5+DE5+DF5=0),Dropdowns!$W$2,IF(AND(CX5=1, CY5>=0, CZ5+ DA5+DB5+DC5+DD5+DE5+DF5=0),Dropdowns!$W$3,IF(AND(CX5=1,CY5+CZ5=1,DA5+DC5=1, DB5=0,DD5=0, DE5+DF5=0),Dropdowns!$W$4,IF(AND(CX5=1,(CY5+CZ5=1),(OR(DA5+DC5+DE5=3, (DB5+DD5+DF5<2))), (DA5+DB5+DC5+DD5+DE5+DF5>=2)), Dropdowns!$W$5,IF(AND(CX5=1,CY5+CZ5=1,(DB5+DD5+DF5>=2),(DA5+DC5+DE5=1)),Dropdowns!$W$6,\"NULL\"))))))","v":""},{"$f":"IF(COUNTIF(DI5:DS5,\"\")=0,\"Yes\",\"No\")","v":"No"},{"$nulls":18},{"$f":"COUNTIF(DT5,\"Yes\")","v":0},0,0,0,0,0,0,{"$f":"IF(COUNTIF(DT5:DV5,\"\")=COLUMNS(DT5:DV5),\"\",IF(AND(EA5+EB5+EC5+EG5=0),Dropdowns!$X$2,IF(AND(EA5=1,EB5+EC5+EG5=0),Dropdowns!$X$3,IF(AND(EA5+EB5=2,EC5+EG5=0),Dropdowns!$X$4,IF(AND(EA5+EB5+EC5=3,EG5=0), Dropdowns!$X$5,IF(AND(EA5+EB5+EC5+EG5=4),Dropdowns!$X$6,\"NULL\"))))))","v":""}]
[{"$nulls":19},{"$f":"IF(COUNTIF(U6:AE6,\"\")=0, \"Yes\", \"No\")","v":"No"},{"$nulls":23},{"$f":"IF(COUNTIF(AL6:AQ6,\"\")=COLUMNS(AL6:AQ6),\"\",IF(COUNTIF(AM6:AQ6,\"Yes\")<4,\"No\",\"Yes\"))","v":""},{"$nulls":3},{"$f":"IF(COUNTIF(AS6:AU6,\"\")=COLUMNS(AS6:AU6),\"\",IF(COUNTIF(AS6:AU6,\"Yes\")<2,\"No\",\"Yes\"))","v":""},{"$nulls":3},{"$f":"IF(COUNTIF(AV6:AY6,\"\")=COLUMNS(AV6:AY6),\"\",IF((COUNTIF(AV6:AY6,\"Yes\")+COUNTIF(AR6,\"Yes\")+COUNTIF(AL6,\"Yes\"))>=5,Dropdowns!$R$6,IF((COUNTIF(AV6:AY6,\"Yes\")+COUNTIF(AR6,\"Yes\")+COUNTIF(AL6,\"Yes\"))=4,Dropdowns!$R$5,IF((COUNTIF(AV6:AY6,\"Yes\")+COUNTIF(AR6,\"Yes\")+COUNTIF(AL6,\"Yes\"))=3,Dropdowns!$R$5,IF((COUNTIF(AV6:AY6,\"Yes\")+COUNTIF(AR6,\"Yes\")+COUNTIF(AL6,\"Yes\"))=2,Dropdowns!$R$4,IF((COUNTIF(AV6:AY6,\"Yes\")+COUNTIF(AR6,\"Yes\")+COUNTIF(AL6,\"Yes\"))=1,Dropdowns!$R$3,IF((COUNTIF(AV6:AY6,\"Yes\")+COUNTIF(AR6,\"Yes\")+COUNTIF(AL6,\"Yes\"))=0,Dropdowns!$R$2, \"NULL\")))))))","v":""},{"$f":"IF(COUNTIF(BB6:BE6, \"\")=0,\"Yes\",\"No\")","v":"No"},{"$nulls":10},{"$f":"COUNTIF(BF6, \"Yes\")","v":0},{"$f":"COUNTIF(BG6:BH6, \"Yes*\")","v":0},{"$f":"COUNTIF(BI6, \"Yes - BASIC\")","v":0},{"$f":"COUNTIF(BI6, \"Yes - THOROUGH\")","v":0},{"$f":"COUNTIF(BJ6, \"Yes - BASIC\")","v":0},{"$f":"COUNTIF(BJ6, \"Yes - THOROUGH\")","v":0},{"$f":"COUNTIF(BK6, \"Yes\")","v":0},{"$f":"IF(COUNTIF(BF6:BK6,\"\")=COLUMNS(BF6:BK6),\"\",IF(AND(BL6+BM6+BO6+BR6=0),Dropdowns!$U$2,IF(AND(BL6=1,BM6>=0,BO6+BP6+BQ6+BR6=0, BN6>=0),Dropdowns!$U$3,IF(AND(BL6=1,BM6>=0,BN6+BP6=2,BO6+BQ6=0, BR6>=0),Dropdowns!$U$4,IF(AND(BL6=1,BM6>=0,BN6=0,BO6=1,BP6>=0,BQ6=0,BR6>=0),Dropdowns!$U$5,IF(AND(BL6=1,BM6>=1,BN6=0,BO6=1,BP6=0,BQ6=1,BR6>=0),Dropdowns!$U$6,\"NULL\"))))))","v":""},{"$f":"IF(COUNTIF(BU6:BY6,\"\")=0,\"Yes\",\"No\")","v":"No"},{"$nulls":12},{"$f":"COUNTIF(BZ6, \"Yes*\")","v":0},{"$f":"COUNTIF(CA6, \"Yes - BASIC\")","v":0},{"$f":"COUNTIF(CA6, \"Yes - THOROUGH\")","v":0},{"$f":"COUNTIF(CB6, \"Yes*\")","v":0},{"$f":"COUNTIF(CC6, \"Yes*\")","v":0},{"$f":"COUNTIF(CD6:CE6, \"Yes\")","v":0},{"$f":"COUNTIF(CF6, \"Yes\")","v":0},{"$f":"IF(COUNTIF(BZ6:CF6,\"\")=COLUMNS(BZ6:CF6),\"\",IF(AND(CG6=0,CH6=0,CJ6=0,CK6=0,CL6=0,CM6=0),Dropdowns!$V$2,IF(AND(CG6=1,(CH6+CI6=0),CJ6=0,CK6=0,CL6=0,CM6=0),Dropdowns!$V$3,IF(AND(CG6=1,(CH6>=0),CI6=0,(CJ6>=0),(CK6>=0),CL6=2,CM6=0),Dropdowns!$V$4,IF(AND(CG6=1,(OR(CH6+CI6+CJ6>=2,CI6=1)),CK6=1,CL6>=0,CM6=0),Dropdowns!$V$5,IF(AND(CG6=1,(OR(CH6+CI6+CJ6>=2,CI6=1)),CK6=1,CL6=2,CM6=1),Dropdowns!$V$6,\"NULL\"))))))","v":""},{"$f":"IF(COUNTIF(CP6:CR6, \"\")=0,\"Yes\",\"No\")","v":"No"},{"$nulls":8},{"$f":"COUNTIF(CS6, \"Yes\")","v":0},{"$f":"COUNTIF(CT6,\"Yes - BASIC\")","v":0},{"$f":"COUNTIF(CT6, \"Yes - THOROUGH\")","v":0},{"$f":"COUNTIF(CU6, \"Yes - BASIC\")","v":0},{"$f":"COUNTIF(CU6, \"Yes - THOROUGH\")","v":0},{"$f":"COUNTIF(CV6, \"Yes - BASIC\")","v":0},{"$f":"COUNTIF(CV6, \"Yes - THOROUGH\")","v":0},{"$f":"COUNTIF(CW6, \"Yes - BASIC\")","v":0},{"$f":"COUNTIF(CW6, \"Yes - THOROUGH\")","v":0},{"$f":"IF(COUNTIF(CT6:CW6,\"\")=COLUMNS(CT6:CW6),\"\",IF(AND(CX6+CY6+CZ6+DA6+DB6+DC6+DD6+DE6+DF6=0),Dropdowns!$W$2,IF(AND(CX6=1, CY6>=0, CZ6+ DA6+DB6+DC6+DD6+DE6+DF6=0),Dropdowns!$W$3,IF(AND(CX6=1,CY6+CZ6=1,DA6+DC6=1, DB6=0,DD6=0, DE6+DF6=0),Dropdowns!$W$4,IF(AND(CX6=1,(CY6+CZ6=1),(OR(DA6+DC6+DE6=3, (DB6+DD6+DF6<2))), (DA6+DB6+DC6+DD6+DE6+DF6>=2)), Dropdowns!$W$5,IF(AND(CX6=1,CY6+CZ6=1,(DB6+DD6+DF6>=2),(DA6+DC6+DE6=1)),Dropdowns!$W$6,\"NULL\"))))))","v":""},{"$f":"IF(COUNTIF(DI6:DS6,\"\")=0,\"Yes\",\"No\")","v":"No"},{"$nulls":18},{"$f":"COUNTIF(DT6,\"Yes\")","v":0},0,0,0,0,0,0,{"$f":"IF(COUNTIF(DT6:DV6,\"\")=COLUMNS(DT6:DV6),\"\",IF(AND(EA6+EB6+EC6+EG6=0),Dropdowns!$X$2,IF(AND(EA6=1,EB6+EC6+EG6=0),Dropdowns!$X$3,IF(AND(EA6+EB6=2,EC6+EG6=0),Dropdowns!$X$4,IF(AND(EA6+EB6+EC6=3,EG6=0), Dropdowns!$X$5,IF(AND(EA6+EB6+EC6+EG6=4),Dropdowns!$X$6,\"NULL\"))))))","v":""}]
{"$rows_left_out":8}
{"sheet":"Codebook","index":2,"n_rows":368,"n_cols":4,"rows_kept":368,"merged":[[2,0,5,0],[2,1,5,1],[2,2,5,2],[7,0,18,0],[7,1,18,1],[7,2,18,2],[19,0,21,0],[19,1,21,1],[19,3,21,3],[22,0,24,0],[22,1,24,1],[22,3,24,3],[25,0,27,0],[25,1,27,1],[25,3,27,3],[28,0,40,0],[28,1,40,1],[28,2,40,2],[41,0,44,0],[41,1,44,1],[41,2,44,2],[48,0,54,0],[48,1,54,1],[48,2,54,2],[55,0,63,0],[55,1,63,1],[64,0,74,0],[64,1,74,1],[75,0,84,0],[75,1,84,1],[85,0,88,0],[85,1,88,1],[89,0,97,0],[89,1,97,1],[99,2,99,3],[101,0,110,0],[101,1,110,1],[101,3,110,3],[122,0,127,0],[122,1,127,1],[122,3,127,3],[128,0,131,0],[128,1,131,1],[128,3,131,3],[132,0,134,0],[132,1,134,1],[132,3,134,3],[135,0,139,0],[135,1,139,1],[135,3,139,3],[140,0,146,0],[140,1,146,1],[147,0,151,0],[147,1,151,1],[152,0,160,0],[152,1,160,1],[161,0,164,0],[161,1,164,1],[165,0,168,0],[165,1,168,1],[169,0,171,0],[169,1,171,1],[172,0,174,0],[172,1,174,1],[172,3,174,3],[175,0,185,0],[175,1,185,1],[186,0,193,0],[186,1,193,1],[194,0,196,0],[194,1,196,1],[197,0,199,0],[197,1,199,1],[200,0,202,0],[200,1,202,1],[200,3,202,3],[203,0,205,0],[203,1,205,1],[206,0,212,0],[206,1,212,1],[213,0,220,0],[213,1,220,1],[221,2,221,3],[225,0,226,0],[225,1,226,1],[225,2,226,2],[227,0,229,0],[227,1,229,1],[230,0,232,0],[230,1,232,1],[230,3,232,3],[233,0,235,0],[233,1,235,1],[233,3,235,3],[236,0,240,0],[236,1,240,1],[241,0,245,0],[241,1,245,1],[246,0,248,0],[246,1,248,1],[246,3,248,3],[249,0,254,0],[249,1,254,1],[255,2,255,3],[257,0,258,0],[257,1,258,1],[257,2,258,2],[260,0,261,0],[260,1,261,1],[260,2,261,2],[263,0,265,0],[263,1,265,1],[263,3,265,3],[266,0,269,0],[266,1,269,1],[266,3,269,3],[270,0,272,0],[270,1,272,1],[270,3,272,3],[273,0,275,0],[273,1,275,1],[273,3,275,3],[276,0,278,0],[276,1,278,1],[276,3,278,3],[279,0,281,0],[279,1,281,1],[279,3,281,3],[282,0,284,0],[282,1,284,1],[282,3,284,3],[285,0,293,0],[285,1,293,1],[294,2,294,3],[296,0,297,0],[296,1,297,1],[296,2,297,2],[299,0,301,0],[299,1,301,1],[299,3,301,3],[302,0,305,0],[302,1,305,1],[306,0,309,0],[306,1,309,1],[310,0,313,0],[310,1,313,1],[314,0,317,0],[314,1,317,1],[318,0,326,0],[318,1,326,1],[327,2,327,3],[339,0,341,0],[339,1,341,1],[339,3,341,3],[342,0,345,0],[342,1,345,1],[342,3,345,3],[346,0,348,0],[346,1,348,1],[346,3,348,3],[349,0,351,0],[349,1,351,1],[349,3,351,3],[352,0,354,0],[352,1,354,1],[352,3,354,3],[355,0,357,0],[355,1,357,1],[358,0,360,0],[358,1,360,1],[358,3,360,3],[361,0,366,0],[361,1,366,1]]}
["Variable","No","Label","Notes"]
["Codername",1,"Write your full name (e.g. Kate Bowers)","This field is now free text to write your name in."]
["Reference",2,"Provide short paper reference - e.g. Welsh(2003)","Please use the following conventions:"]
[{"$nulls":3},"-   Author1 (Year)"]
[{"$nulls":3},"-   Author1 & Author2 (Year)"]
[{"$nulls":3},"-   Author1 et. al. (Year)  (for more than two authors)"]
{"$rows_left_out":363}
{"sheet":"RelevantImages","index":3,"n_rows":0,"n_cols":0,"rows_kept":0}

{"sheet":"ChangeLog","index":4,"n_rows":22,"n_cols":2,"rows_kept":22,"hidden":true}
["2014-10-30","Removed Aiden from the development team"]
["2014-10-30","Changes to EFFECT-Q codes for statistical conclusion validity issues outside of a meta-analysis."]
["2014-10-30","New codes inserted to capture direction of effects (individual and overall)"]
["2014-11-01","Data validation changed in cell AA3:12 so that the entry had to be over zero"]
["2014-11-29","Logic changed for Mechanism, Moderator and Implementation"]
["2014-11-29","New code inserted for implementation"]
{"$rows_left_out":17}
{"sheet":"Dropdowns","index":5,"n_rows":14,"n_cols":24,"rows_kept":14,"hidden":true}
["EPPI codes",{"$nulls":5},"Coder name",{"$nulls":7},"Yes/No","Yes/No extended",null,"EffectQSCORE","effecttypeE","Effectinterpretation","MechanismQSCORE","ModeratorQSCORE","ImplementationQSCORE","EconomicsQScore"]
["Intervention","Offtreatment","TargetedOffpop","TargetedNonpop","Outcome3datatype",null,"Aiden Sidebottom",{"$nulls":7},"No","No",null,"0 = No sufficient consideration of validity elements listed above","Proportional change (%)","No significant effect","0 = No reference to theory - simple black box","0 = No reference to relevant contextual conditions that may be necessary","0 = No account of implementation or implementation challenges","0 = No mention of costs (and/or benefits)"]
["* Correctional ","* Behavioural treatment ","* Antisocial ","* Other ","* Anti-social behaviour ",null,"Gloria Laycock",{"$nulls":7},"Yes","Yes - BASIC",null,"1 = Sufficient consideration of one element of validity","Odds ratio","A modest but significant reduction","1 = General statement of assumed theory","1 = Ad hoc description of possible relevant contextual conditions","1 = Ad hoc comments on implementation or implementation challenges","1 = Only direct or explicit costs (and/or benefits) estimated"]
["* Community ","* Biological treatment ","* Domestic abusers ","* Places ","* Arrests ",null,"Jyoti Belur",{"$nulls":8},"Yes - THOROUGH",null,"2 = Sufficient consideration of two elements of validity","Standardised mean difference","A large and significant reduction","2 = Basic tests of the assumed mechanism using variables that are at hand","2 = Tests of the effects of contextual conditions defined post hoc using variables that are at hand ","2 = Concerted efforts to document implementation or implementation challenges","2 = Direct or explicit and indirect and implicit costs (and/or benefits) estimated"]
["* Developmental and social prevention ","* CBT - Cognitive-behavioural therapy ","* Drink drivers ","* Victims ","* Calls for service ",null,"Kate Bowers",{"$nulls":10},"3 = Sufficient consideration of three or four elements of validity","Relative risk ratio","A modest but significant increase","3 = Full description of the theory of change and testable predictions generated from it","3 = Theoretically grounded description of relevant contextual conditions","3 = Evidence-based account of levels of fidelity to program, policy or treatment plans","3 = Marginal or total or opportunity costs (and/or benefits) estimated"]
["* Drug treatment ","* Community based ","* Drug/alcohol abusers ",null,"* Recorded crime ",null,"Ken Pease",{"$nulls":10},"4 = Sufficient consideration of five or six elements of validity","Correlation coefficient","A large and significant increase","4 = Full description of the theory of change and robust analysis of whether this is operating as expected","4 = Collection and analysis of relevant data relating to theoretically grounded moderators and contexts ","4 = Analysis of structural/legal sources of departure from/fidelity to program plans","4 = Marginal or total or opportunity costs (and/or benefits) by bearer (or recipient) estimated"]
{"$rows_left_out":9}
{"sheet":"For developers","index":6,"n_rows":2,"n_cols":20,"rows_kept":2,"hidden":true}
["Titletoshow","Offenderfocus","Victimfocus","Placefocus","Outcomeproperty","Outcomeviolent","Effect highlighted?","EffectQSCORE","Mechanism-E","MechanismQSCORE","MechanismQScore in words","Moderator-E","ModeratorQSCORE","ModeratorQScore in words","Implementation-E","ImplementationQSCORE","ImplementationQSCORE in words","Economics-E","EconomicsQSCORE","EconomicsQSCORE in words"]
[{"$f":"Data!#REF!","v":{"$error":"#REF!"}},{"$f":"Data!E5","v":0},{"$f":"Data!F5","v":0},{"$f":"Data!G5","v":0},{"$f":"Data!N5","v":0},{"$f":"Data!O5","v":0},null,{"$f":"Data!AZ5","v":""},{"$f":"Data!BA13","v":0},{"$f":"Data!BS13","v":0},null,{"$f":"Data!BT13","v":0},{"$f":"Data!CN13","v":0},null,{"$f":"Data!CQ13","v":0},{"$f":"Data!DI13","v":0},null,{"$f":"Data!DJ13","v":0},{"$f":"Data!EJ13","v":0}]